this derivation will be built: /nix/store/b7mnmm1r57xwnw53sifhwx2xx2h3d6hh-run-check-harness-psql-17.drv error: Cannot build '/nix/store/b7mnmm1r57xwnw53sifhwx2xx2h3d6hh-run-check-harness-psql-17.drv'. Reason: builder failed with exit code 1. Output paths: /nix/store/il3l0gn7z449a9hasw76in49y9dq8msx-run-check-harness-psql-17 Last 25 log lines: > test roles ... ok 12 ms > test security ... ok 10 ms > test storage ... ok 13 ms > test supautils_reserved_roles ... ok 9 ms > test supautils_restrict_versions ... ok 80 ms > test vault ... ok 30 ms > test wal2json ... ok 41 ms > test z_17_ext_interface ... FAILED 110 ms > test z_17_intarray_ltree_query ... ok 14 ms > test z_17_pg_stat_monitor ... ok 7 ms > test z_17_pgvector ... ok 14 ms > test z_17_roles ... ok 16 ms > test z_17_rum ... ok 17 ms > > ======================= > 2 of 68 tests failed. > ======================= > > The differences that caused some tests to fail can be viewed in the > file "/nix/store/il3l0gn7z449a9hasw76in49y9dq8msx-run-check-harness-psql-17/regression_output/regression.diffs". A copy of the test summary that you see > above is saved in the file "/nix/store/il3l0gn7z449a9hasw76in49y9dq8msx-run-check-harness-psql-17/regression_output/regression.out". > > 2026-10-07 14:26:25 [ERROR] pg_regress tests failed > 2026-10-07 14:26:25 [ERROR] An error occurred. Exit code: 1 > 2026-10-07 14:26:25 [ERROR] Debug logs: For full logs, run: nix log /nix/store/b7mnmm1r57xwnw53sifhwx2xx2h3d6hh-run-check-harness-psql-17.drv