nixbot

builds
1this derivation will be built:2 /nix/store/rcfg8pvxn6yk6d2w6jgjix48wdv2klqz-run-check-harness-psql-orioledb-17.drv3error: Cannot build '/nix/store/rcfg8pvxn6yk6d2w6jgjix48wdv2klqz-run-check-harness-psql-orioledb-17.drv'.4 Reason: builder failed with exit code 1.5 Output paths:6 /nix/store/l80pcj4x689fzyj21lqkk3al1lf2farh-run-check-harness-psql-orioledb-177 Last 25 log lines:8 > test wal2json ... ok 19 ms9 > test z_orioledb-17_docs-cascades-deletes ... ok 86 ms10 > test z_orioledb-17_docs-full-text-search ... ok 31 ms11 > test z_orioledb-17_docs-functions ... ok 359 ms12 > test z_orioledb-17_docs-indexes ... ok 31 ms13 > test z_orioledb-17_docs-partitioning ... ok 43 ms14 > test z_orioledb-17_ext_interface ... FAILED 112 ms15 > test z_orioledb-17_extensions_schema ... ok 9 ms16 > test z_orioledb-17_intarray_ltree_query ... ok 9 ms17 > test z_orioledb-17_pg_stat_monitor ... ok 7 ms18 > test z_orioledb-17_pgroonga ... ok 55 ms19 > test z_orioledb-17_pgvector ... ok 19 ms20 > test z_orioledb-17_verify_orioledb ... ok 17 ms21 >22 > =======================23 > 2 of 65 tests failed.24 > =======================25 >26 > The differences that caused some tests to fail can be viewed in the27 > file "/nix/store/l80pcj4x689fzyj21lqkk3al1lf2farh-run-check-harness-psql-orioledb-17/regression_output/regression.diffs". A copy of the test summary that you see28 > above is saved in the file "/nix/store/l80pcj4x689fzyj21lqkk3al1lf2farh-run-check-harness-psql-orioledb-17/regression_output/regression.out".29 >30 > 2026-10-07 12:46:33 [ERROR] pg_regress tests failed31 > 2026-10-07 12:46:33 [ERROR] An error occurred. Exit code: 132 > 2026-10-07 12:46:33 [ERROR] Debug logs:33 For full logs, run:34 nix log /nix/store/rcfg8pvxn6yk6d2w6jgjix48wdv2klqz-run-check-harness-psql-orioledb-17.drv