setup
checks.x86_64-linux.psql_15
· build #150
· raw
1this derivation will be built:2 /nix/store/dlq1am1n7c9s5s17d364r4i2ixfykzix-run-check-harness-psql-15.drv3error: Cannot build '/nix/store/dlq1am1n7c9s5s17d364r4i2ixfykzix-run-check-harness-psql-15.drv'.4 Reason: builder failed with exit code 1.5 Output paths:6 /nix/store/4nnkh6bas4krq4avcn7zi9l1aibcilz9-run-check-harness-psql-157 Last 25 log lines:8 > test supautils_restrict_versions ... ok 84 ms9 > test vault ... ok 29 ms10 > test wal2json ... ok 19 ms11 > test z_15_ext_interface ... FAILED 656 ms12 > test z_15_intarray_ltree_query ... ok 13 ms13 > test z_15_pg_stat_monitor ... ok 11 ms14 > test z_15_pgjwt ... ok 20 ms15 > test z_15_pgvector ... ok 34 ms16 > test z_15_plv8 ... ok 48 ms17 > test z_15_roles ... ok 17 ms18 > test z_15_rum ... ok 18 ms19 > test z_15_timescale ... ok 22 ms20 > test z_15_unhype_timescale_to_partman ... ok 11365 ms21 >22 > =======================23 > 2 of 72 tests failed.24 > =======================25 >26 > The differences that caused some tests to fail can be viewed in the27 > file "/nix/store/4nnkh6bas4krq4avcn7zi9l1aibcilz9-run-check-harness-psql-15/regression_output/regression.diffs". A copy of the test summary that you see28 > above is saved in the file "/nix/store/4nnkh6bas4krq4avcn7zi9l1aibcilz9-run-check-harness-psql-15/regression_output/regression.out".29 >30 > 2026-10-07 12:47:00 [ERROR] pg_regress tests failed31 > 2026-10-07 12:47:00 [ERROR] An error occurred. Exit code: 132 > 2026-10-07 12:47:00 [ERROR] Debug logs:33 For full logs, run:34 nix log /nix/store/dlq1am1n7c9s5s17d364r4i2ixfykzix-run-check-harness-psql-15.drv