setup
checks.aarch64-linux.psql_15_slim
· build #150
· raw
1this derivation will be built:2 /nix/store/jxm7k4cphwialamhpyiqix0wi6rkx256-run-check-harness-psql-15-slim.drv3error: build of '/nix/store/jxm7k4cphwialamhpyiqix0wi6rkx256-run-check-harness-psql-15-slim.drv' on 'ssh-ng://nixbot-remote-build@78.232.36.247' failed: Cannot build '/nix/store/jxm7k4cphwialamhpyiqix0wi6rkx256-run-check-harness-psql-15-slim.drv'.4 Reason: builder failed with exit code 1.5 Output paths:6 /nix/store/fy6fyymnj22gw22pq5c30mq8rs5kb142-run-check-harness-psql-15-slim7 Last 25 log lines:8 > test supautils_restrict_versions ... ok 165 ms9 > test vault ... ok 59 ms10 > test wal2json ... ok 63 ms11 > test z_15_ext_interface ... FAILED 1513 ms12 > test z_15_intarray_ltree_query ... ok 16 ms13 > test z_15_pg_stat_monitor ... ok 15 ms14 > test z_15_pgjwt ... ok 29 ms15 > test z_15_pgvector ... ok 86 ms16 > test z_15_plv8 ... ok 79 ms17 > test z_15_roles ... ok 24 ms18 > test z_15_rum ... ok 40 ms19 > test z_15_timescale ... ok 51 ms20 > test z_15_unhype_timescale_to_partman ... ok 18651 ms21 >22 > =======================23 > 2 of 72 tests failed.24 > =======================25 >26 > The differences that caused some tests to fail can be viewed in the27 > file "/nix/store/fy6fyymnj22gw22pq5c30mq8rs5kb142-run-check-harness-psql-15-slim/regression_output/regression.diffs". A copy of the test summary that you see28 > above is saved in the file "/nix/store/fy6fyymnj22gw22pq5c30mq8rs5kb142-run-check-harness-psql-15-slim/regression_output/regression.out".29 >30 > 2026-10-07 12:41:08 [ERROR] pg_regress tests failed31 > 2026-10-07 12:41:08 [ERROR] An error occurred. Exit code: 132 > 2026-10-07 12:41:08 [ERROR] Debug logs:33 For full logs, run:34 nix log /nix/store/jxm7k4cphwialamhpyiqix0wi6rkx256-run-check-harness-psql-15-slim.drv35error: Cannot build '/nix/store/jxm7k4cphwialamhpyiqix0wi6rkx256-run-check-harness-psql-15-slim.drv'.36 Reason: builder failed with exit code 1.37 Output paths:38 /nix/store/fy6fyymnj22gw22pq5c30mq8rs5kb142-run-check-harness-psql-15-slim