this derivation will be built: /nix/store/a3jkv4i829jq9832w6by7j30qzc7ad8h-run-check-harness-psql-15-slim.drv error: Cannot build '/nix/store/a3jkv4i829jq9832w6by7j30qzc7ad8h-run-check-harness-psql-15-slim.drv'. Reason: builder failed with exit code 1. Output paths: /nix/store/p2adh1s2gnax8bb8hklh7c6pl3c4ylqz-run-check-harness-psql-15-slim Last 25 log lines: > test supautils_restrict_versions ... ok 84 ms > test vault ... ok 30 ms > test wal2json ... ok 16 ms > test z_15_ext_interface ... FAILED 645 ms > test z_15_intarray_ltree_query ... ok 11 ms > test z_15_pg_stat_monitor ... ok 12 ms > test z_15_pgjwt ... ok 19 ms > test z_15_pgvector ... ok 32 ms > test z_15_plv8 ... ok 53 ms > test z_15_roles ... ok 17 ms > test z_15_rum ... ok 19 ms > test z_15_timescale ... ok 22 ms > test z_15_unhype_timescale_to_partman ... ok 11392 ms > > ======================= > 2 of 72 tests failed. > ======================= > > The differences that caused some tests to fail can be viewed in the > file "/nix/store/p2adh1s2gnax8bb8hklh7c6pl3c4ylqz-run-check-harness-psql-15-slim/regression_output/regression.diffs". A copy of the test summary that you see > above is saved in the file "/nix/store/p2adh1s2gnax8bb8hklh7c6pl3c4ylqz-run-check-harness-psql-15-slim/regression_output/regression.out". > > 2026-10-06 23:58:47 [ERROR] pg_regress tests failed > 2026-10-06 23:58:47 [ERROR] An error occurred. Exit code: 1 > 2026-10-06 23:58:47 [ERROR] Debug logs: For full logs, run: nix log /nix/store/a3jkv4i829jq9832w6by7j30qzc7ad8h-run-check-harness-psql-15-slim.drv